eLTER Controlled Lists
type: ConceptScheme

array
type: Concept
in scheme: eLTER Controlled Lists
source: data-types
contributor: 0000-0003-2195-3997
definition: Also known as a list, an array is a data type that stores a number of elements in a specific order, typically all of the same type.
broader: data type
creator: 0000-0003-2195-3997

data type
type: Concept
narrower: array