eLTER Controlled Lists
type: ConceptScheme

enumeration type
type: Concept
in scheme: eLTER Controlled Lists
source: data-types
contributor: 0000-0003-2195-3997
alternative label: enum
definition: It contains a small set of predefined unique values (also known as elements or enumerators) that can be compared and assigned to a variable of enumerated data type.
broader: data type
creator: 0000-0003-2195-3997

data type
type: Concept
narrower: enumeration type