eLTER Controlled Lists
type: ConceptScheme

data type
type: Concept
narrower: timestamp

timestamp
type: Concept
contributor: 0000-0003-2195-3997
creator: 0000-0003-2195-3997
source: data-types
broader: data type
definition: Typically represented in Unix time, a timestamp represents the number of seconds that have elapsed since midnight (00:00:00 UTC), 1st January 1970.
in scheme: eLTER Controlled Lists