EnvThes
type: ConceptScheme

deprecated concept
type: Concept

host range
in scheme: EnvThes
type: Concept
alternative label: hosts ranging
alternative label: hosts range
alternative label: host ranging
alternative label: host ranges
alternative label: host rang
scope note: MS Academic Keywords
definition: [Henderson's] the range of different species, or cell types, that a pathogen can infect.
broader: deprecated concept
deprecated: true
creator: https://orcid.org/0000-0003-2195-3997