EnvThes
type: ConceptScheme

deprecated concept
type: Concept

convention on biological diversity
in scheme: EnvThes
type: Concept
alternative label: CBD
scope note: MS Academic Keywords
definition: [Marcus Zisenis] The Convention on Biological Diversity (CBD) is a major step forward towards an integrated approachof biodiversity and conservation to sustainable development. The CBD mentions in its preamble theintrinsic value of biological diversity and the ecological, genetic, social, economic, scientific,educational, cultural, recreational and aesthetic values of biological diversity and itscomponents...
broader: deprecated concept
deprecated: true
creator: https://orcid.org/0000-0003-2195-3997