EnvThes
type: ConceptScheme

deprecated concept
type: Concept

contaminated soil
in scheme: EnvThes
type: Concept
scope note: MS Academic Keywords
definition: [GEMET] Soil which because of its previous or current use has substances under, on or in it which, depending upon their concentration and/or quantity, may represent a direct potential or indirect hazard to man or to the environment.
broader: deprecated concept
deprecated: true
creator: https://orcid.org/0000-0003-2195-3997