EnvThes
type: ConceptScheme

deprecated concept
type: Concept

building
in scheme: EnvThes
type: Concept
note: [controlled by ] Mark Frenzel, 22 May 2013
scope note: US LTER controlled vocabulary
definition: [GEMET] Something built with a roof and walls, such as a house or factory.
broader: deprecated concept
deprecated: true