EnvThes
type: ConceptScheme

deprecated concept
type: Concept

physical property
in scheme: EnvThes
type: Concept
scope note: US LTER controlled vocabulary
definition: a physical property (quantity) regardless of the object of interest or matrix
broader: deprecated concept
deprecated: true