EnvThes
type: ConceptScheme

deprecated concept
type: Concept

treeline
in scheme: EnvThes
type: Concept
scope note: US LTER controlled vocabulary
definition: The limit beyond which trees cannot or do not occur, commonly at high elevation or geographical latitude but sometimes also because of aridity, flooding, or air pollution
broader: deprecated concept
deprecated: true