EnvThes
type: ConceptScheme

deprecated concept
type: Concept

terrestrial
in scheme: EnvThes
type: Concept
is replaced by: https://vocabs.lter-europe.net/elter_cl/10386
scope note: US LTER controlled vocabulary
definition: [Henderson's] a. living or found on land, as opposed to in rivers, lakes or oceans or in the atmosphere.
broader: deprecated concept
deprecated: true