EnvThes
type: ConceptScheme

deprecated concept
type: Concept

standing crop
in scheme: EnvThes
type: Concept
scope note: US LTER controlled vocabulary
definition: [Henderson's] the biomass of a particular area or ecosystem at any speciﬁed time.
broader: deprecated concept
deprecated: true