EnvThes
type: ConceptScheme

deprecated concept
type: Concept

spatial variability
in scheme: EnvThes
type: Concept
scope note: US LTER controlled vocabulary
definition: Spatial variability occurs when a quantity that is measured at different spatial locations exhibits values that differ across the locations.
broader: deprecated concept
deprecated: true