EnvThes
type: ConceptScheme

deprecated concept
type: Concept

accredited formal LTER site / LTSER platform
in scheme: EnvThes
type: Concept
scope note: Declaration status acredited by LTER Europe
broader: deprecated concept
deprecated: true