EnvThes
type: ConceptScheme

deprecated concept
type: Concept

parameter
in scheme: EnvThes
type: Concept
note: [controlled by ] U Grandin, 2013-08-22
definition: [GEMET] 1) A quantity in an equation which must be specified beside the independent variables to obtain the solution for the dependent variables. 2) A quantity which is constant under a given set of conditions, but may be different under other conditions.
broader: deprecated concept
deprecated: true
preferred label: paramètre @fr