EnvThes
type: ConceptScheme

deprecated concept
type: Concept

unstructured concept
in scheme: EnvThes
type: Concept
definition: container for concepts, where the position in the hierarchy of the thesaurus is not yet clear or decided
broader: deprecated concept
deprecated: true