EnvThes
type: ConceptScheme

deprecated concept
type: Concept

sediment
in scheme: EnvThes
type: Concept
scope note: LTER EU controlled vocabulary
definition: [GEMET] Any material transported by water which will ultimately settle to the bottom after the water loses its transporting power.
broader: deprecated concept
deprecated: true
preferred label: sédiment @fr