EnvThes
type: ConceptScheme

deprecated concept
type: Concept

WRB 2006 Soil type
in scheme: EnvThes
type: Concept
note: [controlled by ] Lars Lundin 20130614" , "[source of definition ] WRB 2006
definition: Soil classification by the World Reference Base system of 2006
broader: deprecated concept
deprecated: true