EnvThes
type: ConceptScheme

deprecated concept
type: Concept

budget
in scheme: EnvThes
type: Concept
definition: [Henderson's] see energy budget, time and energy budget.
broader: deprecated concept
deprecated: true