EnvThes
type: ConceptScheme

deprecated concept
type: Concept

plant part chemical composition
in scheme: EnvThes
type: Concept
definition: [GEMET] The nature and proportions of the elements comprising a chemical compound of the plant part
broader: deprecated concept
deprecated: true