EnvThes
type: ConceptScheme

deprecated concept
type: Concept

COL-TEST
in scheme: EnvThes
type: Concept
scope note: third source , "first source , "second source
definition: Test in order to show what could be done within the catalogue of life
broader: deprecated concept
deprecated: true