EnvThes
type: ConceptScheme

deprecated concept
type: Concept

ecosystem diversity
in scheme: EnvThes
type: Concept
contributor: 0000-0002-3656-417X
scope note: is it possible to show ecosystem diversity only as a untergeordnetes Konzept in disciplines-biodiversity, but not in biology-biodiversity? Generally, there are these 3 levels of biodiversity (genes, species, ecosystems), but you cannot deal with diversity
definition: Ecosystem diversity refers to the diversity of a place at the level of ecosystems.
broader: deprecated concept
deprecated: true
creator: 0000-0002-3656-417X