EnvThes
type: ConceptScheme

deprecated concept
type: Concept

freshwater
in scheme: EnvThes
type: Concept
note: [controlled by ] Heikki Hamalainen
scope note: MAES Working Group
definition: [Henderson's] a. pert. or living in water con­taining less than 0.5 parts per thousand dissolved salt (sodium chloride), such as that in rivers, ponds and lakes. cf. brackish water, seawater.
broader: deprecated concept
deprecated: true
preferred label: eau douce @fr
creator: 0000-0003-0631-8231