EnvThes
type: ConceptScheme

image
in scheme: EnvThes
type: Concept
definition: [NASA] Pictorial representation of data acquired by satellite systems, such as direct readout images from environmental satellites. An image is not a photograph. An image is composed of two-dimensional grids of individual picture elements (pixels). Each pixel has a numeric value that corresponds to the radiance or temperature of the specific ground area it depicts.
broader: device
preferred label: εικόνα @el
creator: https://orcid.org/0000-0003-2195-3997

device
type: Concept
narrower: image