EnvThes
type: ConceptScheme

plant nutrition
in scheme: EnvThes
type: Concept
definition: [Wikipedia] Plant nutrition is the study of the chemical elements and compounds necessary for plant growth, plant metabolism and their external supply
broader: biology
preferred label: 植物营养 @zh
preferred label: 植物栄養 @ja
modified: 2018-12-11

biology
preferred label: 生物学 @zh
preferred label: علم الأحياء - البيولوجيا @ar
preferred label: Биология @bg
preferred label: βιολογία @el
preferred label: biológia @sk
preferred label: bioloģija @lv
preferred label: bioloogia @et
preferred label: biología @es
preferred label: biologija @sl
preferred label: Biologie @de
preferred label: biologi @da
preferred label: biologia @fi
preferred label: biologie @cs
narrower: plant nutrition
type: Concept