EnvThes
type: ConceptScheme

environmental risk
in scheme: EnvThes
type: Concept
scope note: MS Academic Keywords
definition: [GEMET] Likelihood, or probability, of injury, disease, or death resulting from exposure to a potential environmental hazard.
broader: environmental assessment
creator: https://orcid.org/0000-0003-2195-3997

environmental assessment
type: Concept
narrower: environmental risk