EnvThes
type: ConceptScheme

cover
in scheme: EnvThes
type: Concept
note: [controlled by ] U Grandin, 2013-08-22
alternative label: coverage
definition: the number of species, or the proportion of an area covered by a species
broader: observable property

observable property
type: Concept
narrower: cover