EnvThes
type: ConceptScheme

environmental health
in scheme: EnvThes
type: Concept
scope note: MS Academic Keywords
definition: [GEMET] The art and science of the protection of good health, the prevention of disease and injury through the control of positive environmental factors, and the reduction of potential physical, biological, chemical and radiological hazards.
broader: environmental science
creator: https://orcid.org/0000-0003-2195-3997

environmental science
type: Concept
narrower: environmental health