EnvThes
type: ConceptScheme

nitrogen deposition
in scheme: EnvThes
type: Concept
scope note: US LTER controlled vocabulary
definition: The input of reactive nitrogen species from the atmosphere to the biosphere
broader: biogeochemical process
modified: 2019-06-12

biogeochemical process
type: Concept
narrower: nitrogen deposition