EnvThes
type: ConceptScheme

leaching
in scheme: EnvThes
type: Concept
note: [source of definition ] wikipedia" , "[controlled by ] Neagu Stefan 07/06/13
definition: loss of soluble constituents from soil by the action of percolating liquid
broader: biogeochemical process

biogeochemical process
type: Concept
narrower: leaching