EnvThes
type: ConceptScheme

carbon dioxide surface flux
in scheme: EnvThes
change note: @f77eafa1ec8b0040cc244e05f102e13c" , "@05f1442498d2030c01696d49b2c1c20b
type: Concept
contributor: 0000-0002-3565-4624
alternative label: CO2 surface flux
definition: For the exchange of chemicals (water,CO2, etc.) a surface ﬂux is deﬁned as the amount per unit volume of a quantity that passes through a horizontal unit area on the surface
broader: biological process
creator: 0000-0002-3565-4624

biological process
type: Concept
narrower: carbon dioxide surface flux