EnvThes
type: ConceptScheme

disturbance (process)
in scheme: EnvThes
type: Concept
scope note: US LTER controlled vocabulary
definition: [Henderson's, altered] n. in ecology, any perturbation (either natural or caused by humans) experienced by an ecosystem over a longer time period.
broader: biological process
deprecated: false

biological process
type: Concept
narrower: disturbance (process)