EnvThes
type: ConceptScheme

environmental pollution
in scheme: EnvThes
type: Concept
scope note: MS Academic Keywords
definition: [GEMET] The introduction by man into the environment of substances or energy liable to cause hazards to human health, harm to living resources and ecological systems, damage to structure or amenity, or interference with legitimate uses of the environment.
broader: biological process
creator: https://orcid.org/0000-0003-2195-3997

biological process
type: Concept
narrower: environmental pollution