EnvThes
type: ConceptScheme

survivorship
in scheme: EnvThes
type: Concept
scope note: US LTER controlled vocabulary
definition: [Henderson's] demographic data giving the number of individuals surviv­ing to each particular age in a population.
broader: derived property
modified: 2019-06-12

derived property
type: Concept
narrower: survivorship