EnvThes
type: ConceptScheme

aboveground production
in scheme: EnvThes
type: Concept
scope note: US LTER controlled vocabulary
definition: [Henderson's, modified] the aboveground compartment of carbon assimilated and fixated by autotrophs
broader: biological process
modified: 2019-06-12

biological process
type: Concept
narrower: aboveground production