EnvThes
type: ConceptScheme

leaf senescence
in scheme: EnvThes
type: Concept
scope note: MS Academic Keywords
definition: [Chunjiang Zhou] Leaf senescence is a developmentally programmed cell death process that constitutes the final step of leaf development, and it can be regulated by multiple environmental cues and endogenous signals.
broader: biological process
creator: https://orcid.org/0000-0003-2195-3997

biological process
type: Concept
narrower: leaf senescence