EnvThes
type: ConceptScheme

ice
in scheme: EnvThes
type: Concept
note: [controlled by ] Heikki Hamalainen
scope note: US LTER controlled vocabulary
definition: [GEMET] The dense substance formed by the freezing of water to the solid state; it commonly occurs in the form of hexagonal crystals.
broader: water
preferred label: 氷 @ja
preferred label: 冰 @zh
preferred label: الجليد @ar
preferred label: Лед @bg
preferred label: πάγος @el
preferred label: ľad @sk
preferred label: lód @pl
preferred label: ledus @lv
preferred label: ledas @lt
preferred label: led @sl
preferred label: Eis @de
preferred label: gelo @pt
preferred label: gheaţă @ro
preferred label: ghiaccio @it
preferred label: glace @fr
preferred label: hielo @es
preferred label: ijs @nl
preferred label: is @da
preferred label: jää @et
preferred label: jég @hu

water
preferred label: 水 @zh
type: Concept
narrower: ice