EnvThes
type: ConceptScheme

lysimeter
in scheme: EnvThes
type: Concept
note: [controlled by ] Neagu Stefan 31/05/13" , "[source of definition ] wikipedia
scope note: US LTER controlled vocabulary
definition: measuring device which can be used to measure the quantity and quality of soil solution, and indirectly the amount of actual evapotranspiration which is released by plants, usually crops or trees.
broader: device
modified: 2019-06-12

device
type: Concept
narrower: lysimeter