EnvThes
type: ConceptScheme

moisture sensor
in scheme: EnvThes
type: Concept
note: [controlled by ] Giorgio Matteucci , 29/05/2013" , "[source of definition ] Expert, partly mutuated by GEMET item \\"Detector\\
definition: An electrical, electronic, or automatic device that automatically identifies changes in air humidity
broader: on-site sensor

on-site sensor
type: Concept
narrower: moisture sensor