EnvThes
type: ConceptScheme

agricultural intensification
in scheme: EnvThes
type: Concept
scope note: MS Academic Keywords
definition: [A. J. Shriar] Agricultural intensification is a process of raising land productivity over time through increasesin inputs of one form or another on a per unit area basis. Its study is important for severalreasons, many of which relate to agroforestry objectives...
broader: management practice
creator: https://orcid.org/0000-0003-2195-3997

management practice
type: Concept
narrower: agricultural intensification