EnvThes
type: ConceptScheme

size
in scheme: EnvThes
type: Concept
definition: [BCTEO]* The magnitude of a quantity, such as length or mass, relative to a unit of measurement.
broader: observable property
creator: https://orcid.org/0000-0003-2195-3997

observable property
type: Concept
narrower: size