EnvThes
type: ConceptScheme

deprecated concept
type: Concept

Bio-geographical Region
in scheme: EnvThes
type: Concept
note: Definition edited by Ulf Grandin, 2016-10-14
is replaced by: http://vocabs.lter-europe.net/elter_cl/10546
definition: A designated area of the Earth determined by the distribution of flora and fauna. The concept has been adoped by the European Union, which has recognised nine terrestrial biogeographical regions, each with its own characteristic blend of vegetation, climate and geology. Marine regions were created for practical reasons for the Article 17 reporting and they are used also in the assessment of marine Natura 2000 sites during biogeographical seminars and associated bilateral meetings (EEA, 2002).
broader: deprecated concept
deprecated: true