EnvThes
type: ConceptScheme

deprecated concept
type: Concept

wind measure
type: Concept
in scheme: EnvThes
scope note: US LTER controlled vocabulary
definition: [GEMET] The motion of air relative to the earth's surface; usually means horizontal air motion, as distinguished from vertical motion.
broader: deprecated concept
deprecated: true
preferred label: vent @fr