EnvThes
type: ConceptScheme

deprecated concept
type: Concept

water level
type: Concept
in scheme: EnvThes
scope note: US LTER controlled vocabulary
definition: [GEMET] The level reached by the surface of a body of water.
broader: deprecated concept
deprecated: true
preferred label: niveau d'eau @fr