EnvThes
type: ConceptScheme

deprecated concept
type: Concept

temperature
type: Concept
in scheme: EnvThes
scope note: US LTER controlled vocabulary
definition: [GEMET] A property that determines the direction of heat flow when an objekt is brought into thermal contact with other objects: heat flows from regions of higher to those of lower temperatures.
broader: deprecated concept
deprecated: true
preferred label: température @fr