EnvThes
type: ConceptScheme

deprecated concept
type: Concept

nutrient
type: Concept
in scheme: EnvThes
scope note: US LTER controlled vocabulary
definition: [Henderson's] n. any substance used or required by an organism as food. see also macro­nutrients, micronutrients.
broader: deprecated concept
deprecated: true