EnvThes
type: ConceptScheme

deprecated concept
type: Concept

hurricane damage
type: Concept
in scheme: EnvThes
scope note: US LTER controlled vocabulary
definition: Damaging effects of a hurricane both on nature and on humans and infrastructures.
broader: deprecated concept
deprecated: true