EnvThes
type: ConceptScheme

deprecated concept
type: Concept

estuarine
type: Concept
in scheme: EnvThes
scope note: US LTER controlled vocabulary
definition: [Henderson's] a. living in the lower part of a river or estuary where freshwater and seawater meet.
broader: deprecated concept
deprecated: true