EnvThes
type: ConceptScheme

ecology
type: Concept
preferred label: 生態学 @ja
preferred label: 生态学 @zh
preferred label: الإيكولوجيا @ar
preferred label: Екология @bg
preferred label: οικολογία @el
preferred label: økologi @no
preferred label: ökológia @hu
preferred label: ökoloogia @et
preferred label: écologie @fr
preferred label: Ökologie @de
preferred label: ecologia @it
preferred label: ecologie @ro
preferred label: ecología @es
preferred label: ekologi @sv
preferred label: ekologia @fi
preferred label: ekologie @cs
preferred label: ekologija @hr
preferred label: ekoloģija @lv
preferred label: ekológia @sk
preferred label: milieu @nl

deprecated concept
type: Concept

ecology
type: Concept
preferred label: écologie @fr
deprecated: true
broader: deprecated concept
definition: [Henderson's] n. (1) the interrelationships be­tween organisms and their environment and each other; (2) the study of these interrelationships. , "http://en.wikipedia.org/wiki/Ecology
scope note: US LTER controlled vocabulary , "the discipline of ecology can be organized by three different concepts, that occur now in parallel here: (1) classification according to organizational level that is considered, includes ecosystem ecology, community ecolog
is replaced by: ecology
contributor: 0000-0002-3656-417X
in scheme: EnvThes