EnvThes
type: ConceptScheme

deprecated concept
type: Concept

potential LTER LTER
type: Concept
in scheme: EnvThes
scope note: Declaration status requested by site manager
broader: deprecated concept
deprecated: true