EnvThes
type: ConceptScheme

deprecated concept
type: Concept

NOx concentration
type: Concept
in scheme: EnvThes
alternative label: atmosphere - nitrogen oxides - concentration
definition: [GEMET] In solutions, the mass, volume, or number of moles of solute present in proportion to the amount of solvent or total solution.
broader: deprecated concept
deprecated: true